×
INDI Library v1.8.1 Released (09 Sep 2019)

Monthly maintenance release INDI v1.8.1

kstars/ekos build fails on ekos/manager.cpp

2 months 2 days ago
fmozza
Expert Boarder
Expert Boarder
Posts: 102
More
Topic Author
kstars/ekos build fails on ekos/manager.cpp #43657
Can't build from nightly kstars/ekos bits due to following error:

[ 13%] Building CXX object kstars/CMakeFiles/KStarsLib.dir/ekos/manager.cpp.o
In file included from /home/jmh/Devel/kstars/kstars/ekos/scheduler/scheduler.h:14:0,
from /home/jmh/Devel/kstars/kstars/ekos/manager.h:30,
from /home/jmh/Devel/kstars/kstars/ekos/manager.cpp:10:
/home/jmh/Devel/build-kstars/kstars/kstars/ui_scheduler.h: In member function ‘void Ui_Scheduler::setupUi(QWidget*)’:
/home/jmh/Devel/build-kstars/kstars/kstars/ui_scheduler.h:432:54: error: ‘PlaceholderText’ is not a member of ‘QPalette’
palette.setBrush(QPalette::Active, QPalette::PlaceholderText, brush1);
^~~~~~~~~~~~~~~
/home/jmh/Devel/build-kstars/kstars/kstars/ui_scheduler.h:438:56: error: ‘PlaceholderText’ is not a member of ‘QPalette’
palette.setBrush(QPalette::Inactive, QPalette::PlaceholderText, brush2);
^~~~~~~~~~~~~~~
/home/jmh/Devel/build-kstars/kstars/kstars/ui_scheduler.h:448:56: error: ‘PlaceholderText’ is not a member of ‘QPalette’
palette.setBrush(QPalette::Disabled, QPalette::PlaceholderText, brush5);
^~~~~~~~~~~~~~~
kstars/CMakeFiles/KStarsLib.dir/build.make:1575: recipe for target 'kstars/CMakeFiles/KStarsLib.dir/ekos/manager.cpp.o' failed
make[2]: *** [kstars/CMakeFiles/KStarsLib.dir/ekos/manager.cpp.o] Error 1
CMakeFiles/Makefile2:432: recipe for target 'kstars/CMakeFiles/KStarsLib.dir/all' failed
make[1]: *** [kstars/CMakeFiles/KStarsLib.dir/all] Error 2
Makefile:140: recipe for target 'all' failed
make: *** [all] Error 2

I also can't see a way to add the bug to github, so I'm doing it here.

Regards,

jmh

Please Log in or Create an account to join the conversation.

2 months 2 days ago
Christian
Expert Boarder
Expert Boarder
Posts: 108
More
kstars/ekos build fails on ekos/manager.cpp #43660
i have the same issue :

[ 6%] Building CXX object kstars/CMakeFiles/KStarsLib.dir/ekos/opsekos.cpp.o
In file included from /home/christian/Projects/kstars/kstars/ekos/scheduler/scheduler.h:14:0,
from /home/christian/Projects/kstars/kstars/ekos/manager.h:30,
from /home/christian/Projects/kstars/kstars/ekos/manager.cpp:10:
/home/christian/Projects/kstars/build/kstars/ui_scheduler.h: In member function ‘void Ui_Scheduler::setupUi(QWidget*)’:
/home/christian/Projects/kstars/build/kstars/ui_scheduler.h:432:54: error: ‘PlaceholderText’ is not a member of ‘QPalette’
palette.setBrush(QPalette::Active, QPalette::PlaceholderText, brush1);
^~~~~~~~~~~~~~~
/home/christian/Projects/kstars/build/kstars/ui_scheduler.h:438:56: error: ‘PlaceholderText’ is not a member of ‘QPalette’
palette.setBrush(QPalette::Inactive, QPalette::PlaceholderText, brush2);
^~~~~~~~~~~~~~~
/home/christian/Projects/kstars/build/kstars/ui_scheduler.h:448:56: error: ‘PlaceholderText’ is not a member of ‘QPalette’
palette.setBrush(QPalette::Disabled, QPalette::PlaceholderText, brush5);
^~~~~~~~~~~~~~~
In file included from /home/christian/Projects/kstars/kstars/ekos/scheduler/scheduler.h:14:0,
from /home/christian/Projects/kstars/kstars/ekos/manager.h:30,
from /home/christian/Projects/kstars/kstars/ekos/opsekos.cpp:13:
/home/christian/Projects/kstars/build/kstars/ui_scheduler.h: In member function ‘void Ui_Scheduler::setupUi(QWidget*)’:
/home/christian/Projects/kstars/build/kstars/ui_scheduler.h:432:54: error: ‘PlaceholderText’ is not a member of ‘QPalette’
palette.setBrush(QPalette::Active, QPalette::PlaceholderText, brush1);
^~~~~~~~~~~~~~~
/home/christian/Projects/kstars/build/kstars/ui_scheduler.h:438:56: error: ‘PlaceholderText’ is not a member of ‘QPalette’
palette.setBrush(QPalette::Inactive, QPalette::PlaceholderText, brush2);
^~~~~~~~~~~~~~~
/home/christian/Projects/kstars/build/kstars/ui_scheduler.h:448:56: error: ‘PlaceholderText’ is not a member of ‘QPalette’
palette.setBrush(QPalette::Disabled, QPalette::PlaceholderText, brush5);
^~~~~~~~~~~~~~~
kstars/CMakeFiles/KStarsLib.dir/build.make:1671: recipe for target 'kstars/CMakeFiles/KStarsLib.dir/ekos/opsekos.cpp.o' failed
make[2]: *** [kstars/CMakeFiles/KStarsLib.dir/ekos/opsekos.cpp.o] Error 1
make[2]: *** Attente des tâches non terminées....
kstars/CMakeFiles/KStarsLib.dir/build.make:1575: recipe for target 'kstars/CMakeFiles/KStarsLib.dir/ekos/manager.cpp.o' failed
make[2]: *** [kstars/CMakeFiles/KStarsLib.dir/ekos/manager.cpp.o] Error 1
CMakeFiles/Makefile2:432: recipe for target 'kstars/CMakeFiles/KStarsLib.dir/all' failed
make[1]: *** [kstars/CMakeFiles/KStarsLib.dir/all] Error 2
Makefile:140: recipe for target 'all' failed
make: *** [all] Error 2

C8 lightbridge, Orion Atlas mount, EOS 1000D modified and ASI120MM for guiding.

Please Log in or Create an account to join the conversation.

2 months 1 day ago
knro
Administrator
Administrator
Posts: 7379
Karma: 51
kstars/ekos build fails on ekos/manager.cpp #43674
Please check now

Jasem Mutlaq
Support INDI & Ekos; Get StellarMate Astrophotography Gadget.
How to Submit Logs when you have problems?
Add your observatory info
The following user(s) said Thank You Christian

Please Log in or Create an account to join the conversation.

2 months 1 day ago
Christian
Expert Boarder
Expert Boarder
Posts: 108
More
kstars/ekos build fails on ekos/manager.cpp #43680
Hi Jasem,

it's works now. Thank.

C8 lightbridge, Orion Atlas mount, EOS 1000D modified and ASI120MM for guiding.

Please Log in or Create an account to join the conversation.

Time to create page: 0.273 seconds